Discussion:
bug#29285: Error building coreutils 8.28.32-a4eed under Archlinux from AUR
(too old to reply)
timofonic timofonic
2017-11-13 14:43:30 UTC
Permalink
Hello.

As the coreutils build system reported, I'm sending the following
building error from using the coreutils-git Arch User Repository
package ( https://aur.archlinux.org/packages/coreutils-git/)

I have no idea who to blame, so I do to both parties. Sorry for the noise ;)

Kind regards from Spain,
Timofonic (José Francisco Carrasco)

============================================================================
Testsuite summary for GNU coreutils 8.28.32-a4eed
============================================================================
# TOTAL: 322
# PASS: 295
# SKIP: 26
# XFAIL: 0
# FAIL: 1
# XPASS: 0
# ERROR: 0
============================================================================
See gnulib-tests/test-suite.log
Please report to bug-***@gnu.org
============================================================================
make[6]: *** [Makefile:6004: test-suite.log] Error 1
make[6]: Leaving directory
'/home/timofonic/.cache/pacaur/coreutils-git/src/coreutils/gnulib-tests'
make[5]: *** [Makefile:6112: check-TESTS] Error 2
make[5]: Leaving directory
'/home/timofonic/.cache/pacaur/coreutils-git/src/coreutils/gnulib-tests'
make[4]: *** [Makefile:8455: check-am] Error 2
make[4]: Leaving directory
'/home/timofonic/.cache/pacaur/coreutils-git/src/coreutils/gnulib-tests'
make[3]: *** [Makefile:5896: check-recursive] Error 1
make[3]: Leaving directory
'/home/timofonic/.cache/pacaur/coreutils-git/src/coreutils/gnulib-tests'
make[2]: *** [Makefile:8457: check] Error 2
make[2]: Leaving directory
'/home/timofonic/.cache/pacaur/coreutils-git/src/coreutils/gnulib-tests'
make[1]: *** [Makefile:11721: check-recursive] Error 1
make[1]: Leaving directory
'/home/timofonic/.cache/pacaur/coreutils-git/src/coreutils'
make: *** [Makefile:12198: check] Error 2
==> ERROR: A failure occurred in check().
Aborting...
:: failed to build coreutils-git package(s)
Assaf Gordon
2018-10-30 02:09:39 UTC
Permalink
tags 29285 moreinfo
stop

(triaging old bugs)

Hello,
Post by timofonic timofonic
As the coreutils build system reported, I'm sending the following
building error from using the coreutils-git Arch User Repository
package ( https://aur.archlinux.org/packages/coreutils-git/)
Based on the attached logs, it's a gnulib test failure;

===
FAIL: test-getlogin
===================

test-getlogin.h:79: assertion 'pwd->pw_uid == stat_buf.st_uid' failed
FAIL test-getlogin (exit status: 134)
====


It's been a while since your report (sorry about that).
Do you still get similar failure with more recent coreutils versions?


-assaf

Loading...